Resultados 1 al 2 de 2






me trae de cabeza


Estás en el tema me trae de cabeza dentro del subforo Desarrollo Enigma2 en LonasDigital. Buenas tardes me he quedado atravesado con una compilacion y queria saber donde esta el error make: se ingresa al directorio «/lugar/usuario/Enigma2PC/lib/base» CXX eenv.o CXX filepush.o In file included from /usr/include/xine/xine_internal.h:54, from ../../lib/gdi/gxlibdc.h:10, from filepush.cpp:3: /usr/include/xine/input_plugin.h:49: error: expected ‘,’ or ‘...’ before ‘this’...



Este tema tuvo 787 Visitas y 1 Respuestas

Actualmente hay 1 usuarios viendo este tema. (0 miembros y 1 visitantes)

  1. #1
    Avatar de franlincol

    franlincol ha iniciado este hilo.
    franlincol está desconectado
    Título:  Usuario Registrado Rango:  Usuario Registrado
    Fecha de ingreso
    Aug-2011
    Nacionalidad
    Espana
    Temas
    1
    Mensajes
    2


    Buenas tardes me he quedado atravesado con una compilacion y queria saber donde esta el error


    make[3]: se ingresa al directorio «/lugar/usuario/Enigma2PC/lib/base»
    CXX eenv.o
    CXX filepush.o
    In file included from /usr/include/xine/xine_internal.h:54,
    from ../../lib/gdi/gxlibdc.h:10,
    from filepush.cpp:3:
    /usr/include/xine/input_plugin.h error: expected ‘,’ or ‘...’ before ‘this’
    /usr/include/xine/input_plugin.h error: expected ‘,’ or ‘...’ before ‘this’
    /usr/include/xine/input_plugin.h error: expected ‘,’ or ‘...’ before ‘this’
    /usr/include/xine/input_plugin.h error: expected ‘,’ or ‘...’ before ‘this’
    /usr/include/xine/input_plugin.h error: expected ‘,’ or ‘...’ before ‘this’
    /usr/include/xine/input_plugin.h error: expected ‘,’ or ‘...’ before ‘this’
    /usr/include/xine/input_plugin.h error: expected ‘,’ or ‘...’ before ‘this’
    /usr/include/xine/input_plugin.h:94: error: expected ‘,’ or ‘...’ before ‘this’
    /usr/include/xine/input_plugin.h error: expected ‘,’ or ‘...’ before ‘this’
    /usr/include/xine/input_plugin.h:119: error: expected ‘,’ or ‘...’ before ‘this’
    /usr/include/xine/input_plugin.h:127: error: expected ‘,’ or ‘...’ before ‘this’
    /usr/include/xine/input_plugin.h:135: error: expected ‘,’ or ‘...’ before ‘this’
    /usr/include/xine/input_plugin.h:147: error: expected ‘,’ or ‘...’ before ‘this’
    /usr/include/xine/input_plugin.h error: expected ‘,’ or ‘...’ before ‘this’
    /usr/include/xine/input_plugin.h:162: error: expected ‘,’ or ‘...’ before ‘this’
    /usr/include/xine/input_plugin.h:182: error: expected ‘,’ or ‘...’ before ‘this’
    /usr/include/xine/input_plugin.h:198: error: expected ‘,’ or ‘...’ before ‘this’
    /usr/include/xine/input_plugin.h:204: error: expected ‘,’ or ‘...’ before ‘this’
    /usr/include/xine/input_plugin.h:210: error: expected ‘,’ or ‘...’ before ‘this’
    /usr/include/xine/input_plugin.h:216: error: expected ‘,’ or ‘...’ before ‘this’
    In file included from /usr/include/xine/xine_internal.h:55,
    from ../../lib/gdi/gxlibdc.h:10,
    from filepush.cpp:3:
    /usr/include/xine/demux.h error: expected ‘,’ or ‘...’ before ‘this’
    /usr/include/xine/demux.h error: expected ‘,’ or ‘...’ before ‘this’
    /usr/include/xine/demux.h error: expected ‘,’ or ‘...’ before ‘this’
    /usr/include/xine/demux.h error: expected ‘,’ or ‘...’ before ‘this’
    /usr/include/xine/demux.h:80: error: expected ‘,’ or ‘...’ before ‘this’
    /usr/include/xine/demux.h error: expected ‘,’ or ‘...’ before ‘this’
    /usr/include/xine/demux.h error: expected ‘,’ or ‘...’ before ‘this’
    /usr/include/xine/demux.h:121: error: expected ‘,’ or ‘...’ before ‘this’
    /usr/include/xine/demux.h:134: error: expected ‘,’ or ‘...’ before ‘this’
    /usr/include/xine/demux.h:140: error: expected ‘,’ or ‘...’ before ‘this’
    /usr/include/xine/demux.h:146: error: expected ‘,’ or ‘...’ before ‘this’
    /usr/include/xine/demux.h error: expected ‘,’ or ‘...’ before ‘this’
    /usr/include/xine/demux.h error: expected ‘,’ or ‘...’ before ‘this’
    /usr/include/xine/demux.h:164: error: expected ‘,’ or ‘...’ before ‘this’
    In file included from /usr/include/xine/xine_internal.h:59,
    from ../../lib/gdi/gxlibdc.h:10,
    from filepush.cpp:3:
    /usr/include/xine/osd.h error: expected ‘,’ or ‘...’ before ‘this’
    /usr/include/xine/osd.h:188: error: expected ‘,’ or ‘...’ before ‘this’
    In file included from /usr/include/xine/xine_internal.h:61,
    from ../../lib/gdi/gxlibdc.h:10,
    from filepush.cpp:3:
    /usr/include/xine/plugin_catalog.h error: expected ‘,’ or ‘...’ before ‘this’
    /usr/include/xine/plugin_catalog.h:97: error: expected ‘,’ or ‘...’ before ‘this’
    In file included from /usr/include/xine/xine_internal.h:62,
    from ../../lib/gdi/gxlibdc.h:10,
    from filepush.cpp:3:
    /usr/include/xine/video_decoder.h error: expected ‘,’ or ‘...’ before ‘this’
    /usr/include/xine/video_decoder.h error: expected ‘,’ or ‘...’ before ‘this’
    /usr/include/xine/video_decoder.h error: expected ‘,’ or ‘...’ before ‘this’
    /usr/include/xine/video_decoder.h error: expected ‘,’ or ‘...’ before ‘this’
    /usr/include/xine/video_decoder.h error: expected ‘,’ or ‘...’ before ‘this’
    /usr/include/xine/video_decoder.h error: expected ‘,’ or ‘...’ before ‘this’
    /usr/include/xine/video_decoder.h error: expected ‘,’ or ‘...’ before ‘this’
    /usr/include/xine/video_decoder.h error: expected ‘,’ or ‘...’ before ‘this’
    /usr/include/xine/video_decoder.h:97: error: expected ‘,’ or ‘...’ before ‘this’
    In file included from /usr/include/xine/xine_internal.h:63,
    from ../../lib/gdi/gxlibdc.h:10,
    from filepush.cpp:3:
    /usr/include/xine/audio_decoder.h error: expected ‘,’ or ‘...’ before ‘this’
    /usr/include/xine/audio_decoder.h error: expected ‘,’ or ‘...’ before ‘this’
    /usr/include/xine/audio_decoder.h error: expected ‘,’ or ‘...’ before ‘this’
    /usr/include/xine/audio_decoder.h error: expected ‘,’ or ‘...’ before ‘this’
    /usr/include/xine/audio_decoder.h error: expected ‘,’ or ‘...’ before ‘this’
    /usr/include/xine/audio_decoder.h error: expected ‘,’ or ‘...’ before ‘this’
    /usr/include/xine/audio_decoder.h error: expected ‘,’ or ‘...’ before ‘this’
    /usr/include/xine/audio_decoder.h error: expected ‘,’ or ‘...’ before ‘this’
    In file included from /usr/include/xine/xine_internal.h:64,
    from ../../lib/gdi/gxlibdc.h:10,
    from filepush.cpp:3:
    /usr/include/xine/spu_decoder.h error: expected ‘,’ or ‘...’ before ‘this’
    /usr/include/xine/spu_decoder.h error: expected ‘,’ or ‘...’ before ‘this’
    /usr/include/xine/spu_decoder.h error: expected ‘,’ or ‘...’ before ‘this’
    /usr/include/xine/spu_decoder.h error: expected ‘,’ or ‘...’ before ‘this’
    /usr/include/xine/spu_decoder.h error: expected ‘,’ or ‘...’ before ‘this’
    /usr/include/xine/spu_decoder.h:80: error: expected ‘,’ or ‘...’ before ‘this’
    /usr/include/xine/spu_decoder.h error: expected ‘,’ or ‘...’ before ‘this’
    /usr/include/xine/spu_decoder.h error: expected ‘,’ or ‘...’ before ‘this’
    /usr/include/xine/spu_decoder.h error: expected ‘,’ or ‘...’ before ‘this’
    In file included from /usr/include/xine/xine_internal.h:65,
    from ../../lib/gdi/gxlibdc.h:10,
    from filepush.cpp:3:
    /usr/include/xine/scratch.h:36: error: expected ‘,’ or ‘...’ before ‘this’
    /usr/include/xine/scratch.h:36: error: format string argument not a string type
    /usr/include/xine/scratch.h:38: error: expected ‘,’ or ‘...’ before ‘this’
    /usr/include/xine/scratch.h:40: error: expected ‘,’ or ‘...’ before ‘this’
    In file included from /usr/include/xine/xine_internal.h:66,
    from ../../lib/gdi/gxlibdc.h:10,
    from filepush.cpp:3:
    /usr/include/xine/broadcaster.h:33: error: expected ‘,’ or ‘...’ before ‘this’
    /usr/include/xine/broadcaster.h:34: error: expected ‘,’ or ‘...’ before ‘this’
    In file included from ../../lib/gdi/gxlibdc.h:10,
    from filepush.cpp:3:
    /usr/include/xine/xine_internal.h:486: error: expected ‘,’ or ‘...’ before ‘this’
    In file included from filepush.cpp:3:
    ../../lib/gdi/gxlibdc.h error: ‘xine_streamtype_data_t’ does not name a type
    make[3]: *** [filepush.o] Error 1
    make[3]: se sale del directorio «/home/franbio/Enigma2PC/lib/base»
    make[2]: *** [all-recursive] Error 1
    make[2]: se sale del directorio «/lugar/usuario/Enigma2PC/lib»
    make[1]: *** [all-recursive] Error 1
    make[1]: se sale del directorio «/lugar/usuario/Enigma2PC»
    make: *** [all] Error 2



    que me pasa doctor ¿es grave?.



    Citar Citar  




  2. #2
    Avatar de corsario1976

    corsario1976 está desconectado
    Título:  Usuario Avanzado Rango:  Usuario Avanzado
    Fecha de ingreso
    May-2008
    Nacionalidad
    Europa
    Ubicación
    UNA GRANDE Y LIBRE
    Temas
    21
    Mensajes
    536


    pues de entrada en ciertas palabras tienes activo lo de los iconos y te salen estos y va a ser un poco comlñicado por parte de la gente entendida que esta sponiendo.....


    Citar Citar  

Subir